BDBM34429 5-(1,3-benzodioxol-5-yl)-3-keto-2-(2-ketoindolin-3-ylidene)-7-methyl-5H-thiazolo[3,2-a]pyrimidine-6-carboxylic acid ethyl ester::5-(1,3-benzodioxol-5-yl)-7-methyl-3-oxo-2-(2-oxo-1H-indol-3-ylidene)-5H-thiazolo[3,2-a]pyrimidine-6-carboxylic acid ethyl ester::MLS000088067::SMR000072283::cid_3246754::ethyl 5-(1,3-benzodioxol-5-yl)-7-methyl-3-oxidanylidene-2-(2-oxidanylidene-1H-indol-3-ylidene)-5H-[1,3]thiazolo[3,2-a]pyrimidine-6-carboxylate::ethyl 5-(1,3-benzodioxol-5-yl)-7-methyl-3-oxo-2-(2-oxo-1,2-dihydro-3H-indol-3-ylidene)-2,3-dihydro-5H-[1,3]thiazolo[3,2-a]pyrimidine-6-carboxylate::ethyl 5-(1,3-benzodioxol-5-yl)-7-methyl-3-oxo-2-(2-oxo-1H-indol-3-ylidene)-5H-[1,3]thiazolo[3,2-a]pyrimidine-6-carboxylate
SMILES CCOC(=O)C1=C(C)N=c2s\c(=C3\C(=O)Nc4ccccc34)c(=O)n2C1c1ccc2OCOc2c1
InChI Key InChIKey=UWZVEZQKYZYGLT-XUTLUUPISA-N
Data  1 IC50
  Tab Delimited (TSV)   2D SDfile   Computed 3D by Vconf -m prep SDfile
Find this compound or compounds like it in BindingDB:
Activity Spreadsheet -- Enzyme Inhibition Constant Data from BindingDB
Found 1 hit for monomerid = 34429
TargetGag-Pol polyprotein(Human immunodeficiency virus type 1 group M subtyp...)
University of Pittsburgh
Curated by PubChem BioAssay
LigandPNGBDBM34429(5-(1,3-benzodioxol-5-yl)-3-keto-2-(2-ketoindolin-3...)
Affinity DataIC50:  1.07E+3nMpH: 8.0 T: 2°C. Assay description: A fluorescence resonance energy transfer assay is developed in 96-well and 384-well microplate formats with robotic manipulation to enable high-throu...
In DepthDetails PCBioAssay